BDBM50143491 C-(9-Benzyl-6-methoxy-2,3,4,9-tetrahydro-1H-carbazol-4-yl)-methylamine::CHEMBL176838
SMILES COc1ccc2n(Cc3ccccc3)c3CCCC(CN)c3c2c1
InChI Key InChIKey=PFWVDEMGTZCRQF-UHFFFAOYSA-N
Data  1 KI
  Tab Delimited (TSV)   2D SDfile   Computed 3D by Vconf -m prep SDfile
Find this compound or compounds like it in BindingDB:
Activity Spreadsheet -- Enzyme Inhibition Constant Data from BindingDB
Found 1 hit for monomerid = 50143491
Target5-hydroxytryptamine receptor 6(Homo sapiens (Human))
Virginia Commonwealth University
Curated by ChEMBL
LigandPNGBDBM50143491(C-(9-Benzyl-6-methoxy-2,3,4,9-tetrahydro-1H-carbaz...)
Affinity DataKi:  300nM. Assay description: Ability to displace [3H]LSD from human 5-hydroxytryptamine 6 receptor transiently expressed in COS-7 cells
In DepthDetails ArticlePubMed